{
  "metadata": {
    "repo_path": "/opt/agent_build_hk_02/workspace/j_Pzho6xOU",
    "repo_url": "https://gitcode.com/openUBMC/webui.git",
    "repo_name": "webui",
    "commit": "132fc1b (!578 fix:修复多Raid卡配置下逻辑盘统计出错问题)",
    "start_time": "2026-09-07T05:58:00",
    "end_time": "2026-09-07T06:21:00",
    "duration_seconds": 1380,
    "total_steps": 22
  },
  "machine_spec": {
    "host_machine": {
      "architecture": "x86_64",
      "cpu_model": "Intel(R) Xeon(R) Gold 6151 CPU @ 3.00GHz",
      "cpu_cores": 32,
      "memory": "62Gi",
      "disk": "197G (40G available)",
      "docker_version": "Docker version 29.1.3, build 29.1.3-0ubuntu3~24.04.2"
    },
    "container": {
      "os": "Ubuntu 24.04.3 LTS",
      "architecture": "x86_64",
      "cpu_cores": 32,
      "memory": "62Gi (共享宿主机)"
    },
    "image_source": {
      "type": "文档推荐镜像",
      "image_name": "swr.cn-north-4.myhuaweicloud.com/openubmc/ubuntu:24.04.2",
      "selection_reason": "README 系统要求章节明确声明本组件仅支持 Ubuntu 24.04 LTS，并给出推荐镜像 swr.cn-north-4.myhuaweicloud.com/openubmc/ubuntu:24.04.2；.devcontainer/devcontainer.json 同样基于 openubmc/ubuntu 镜像，故采用文档推荐镜像"
    }
  },
  "document_reading_summary": {
    "architecture": {
      "source": "README.md - 系统要求章节",
      "value": "x86-64（amd64）"
    },
    "recommended_image": {
      "source": "README.md - 系统要求章节 / .devcontainer/devcontainer.json",
      "value": "swr.cn-north-4.myhuaweicloud.com/openubmc/ubuntu:24.04.2（README 推荐）；devcontainer 标签为 24.04.2_26.06"
    },
    "dependencies": {
      "source": "README.md 环境依赖章节 + manifest 仓库 README 构建指导书 + conanfile.py + package.json",
      "value": [
        "Ubuntu 24.04 LTS（仅支持此版本，openEuler/CentOS/Debian 不支持）",
        "Python >= 3.10（init.py 运行依赖）",
        "Node.js >= 18 LTS（前端开发依赖，init.py 安装 v20.18.0）",
        "bingo 构建工具（由 manifest 仓库 init.py 一键安装，禁止手动 pip install conan）",
        "Conan C/C++ 包管理器（init.py 安装 conan 2.32.0，并配置 openubmc_opensource 远程仓库并登录）",
        "manifest 仓库 init.py 自动安装：gcc/g++、libcurl4t64、libcurl4-openssl-dev、pkg-config、git、wget、curl、pre-commit 工具链（stylua/luacheck）、openubmc-qemu、BMC SDK（/opt/RTOS、/opt/hcc_arm64le）",
        "前端 npm 依赖：Vue 3 + Element Plus + OpenDesign V2 + Vite + Pinia + ESLint + vue-tsc（package.json 声明，bingo build 时 npm install 自动拉取）"
      ]
    },
    "build_commands": {
      "source": "README.md - 构建/组件级构建章节 + manifest README 第3.3节",
      "value": "cd /home/workspace/webui && bingo build --stage=dev"
    },
    "ut_commands": {
      "source": "README.md - 测试章节",
      "value": "npm run lint && npx vue-tsc --noEmit（README 测试章节仅记录此两条命令；仓库另在 package.json 配置 vitest 单元测试套件 \"test\": \"vitest\"，tests/unit/ 下有 10 个用例文件，但 README 未提及）"
    },
    "sample_commands": {
      "source": "README.md - 本地开发调试章节",
      "value": "npm install && npm run dev（启动 Vite 开发服务器 http://localhost:5173，非可执行样例）"
    },
    "special_dependencies": {
      "source": "manifest README 第2.6节 + conanfile.py",
      "value": [
        "manifest 仓库 init.py -user <用户名> -psw <密码>（Conan 远程仓库登录认证，凭证由 openUBMC 用户中心注册的社区账号提供）",
        "Conan 远程仓库：openubmc_opensource https://conan.openubmc.cn/openubmc_opensource",
        "npm 镜像源 registry.npmmirror.com（init.py 配置）",
        "openUBMC APT 源 openubmc-apt-repo.obs.cn-north-4.myhuaweicloud.com"
      ]
    }
  },
  "execution_log": [
    {
      "timestamp": "2026-09-07T05:58:00",
      "command": "pre-commit run --all-files（宿主机本地执行）",
      "success": true,
      "output": "Check .sr Files...(no files to check)Skipped\nCheck JSON...Passed\nCheck YAML...Passed\nprettier...Passed\ntrim trailing whitespace...Passed\nfix end of files...Passed\ncheck for merge conflicts...Passed\ncheck for added large files...Passed\ncheck for case conflicts...Passed\ndetect private key...Passed\nnormalize-package-lock...Passed",
      "error": "",
      "returncode": 0,
      "duration_seconds": 30
    },
    {
      "timestamp": "2026-09-07T05:58:05",
      "command": "find . -name '.lint-runner.*' -o -name 'lint-runner.config.*' -o -name '.lintrunner.*'",
      "success": true,
      "output": "未找到 lint-runner 相关配置文件",
      "error": "",
      "returncode": 0,
      "duration_seconds": 1
    },
    {
      "timestamp": "2026-09-07T05:58:10",
      "command": "ls .devcontainer/ && cat .devcontainer/devcontainer.json",
      "success": true,
      "output": "devcontainer.json 存在；image=swr.cn-north-4.myhuaweicloud.com/openubmc/ubuntu:24.04.2_26.06，workspaceFolder=/workspace，forwardPorts=[8000,8080]，配置 12 个 VSCode 扩展",
      "error": "",
      "returncode": 0,
      "duration_seconds": 1
    },
    {
      "timestamp": "2026-09-07T05:58:30",
      "command": "docker pull swr.cn-north-4.myhuaweicloud.com/openubmc/ubuntu:24.04.2",
      "success": true,
      "output": "Digest: sha256:9dc159af07be6f78d586ba6f3ab67fc8ff115a76710427d0699be30068671103\nStatus: Image is up to date",
      "error": "",
      "returncode": 0,
      "duration_seconds": 2
    },
    {
      "timestamp": "2026-09-07T05:58:35",
      "command": "docker run -d --name ttfhw-webui-env -v <仓库目录>:/home/workspace/webui -w /home/workspace swr.cn-north-4.myhuaweicloud.com/openubmc/ubuntu:24.04.2 tail -f /dev/null",
      "success": true,
      "output": "Container ID: b02f016f1bad；Ubuntu 24.04.3 LTS；ARCH x86_64；CORES 32；MEM 62Gi",
      "error": "",
      "returncode": 0,
      "duration_seconds": 2
    },
    {
      "timestamp": "2026-09-07T05:59:00",
      "command": "docker exec ... apt-get update && apt-get install -y python3 sudo make locales wget curl git libcurl4t64 libcurl4-openssl-dev pkg-config",
      "success": true,
      "output": "基础工具安装完成（裸镜像不含 git/python3/sudo，按 manifest README 1.4 节先安装）",
      "error": "",
      "returncode": 0,
      "duration_seconds": 60
    },
    {
      "timestamp": "2026-09-07T06:03:00",
      "command": "git config --global user.name ****** && git config --global user.email ******@openubmc.cn && git clone --depth 1 https://gitcode.com/openUBMC/manifest.git /home/workspace/manifest",
      "success": true,
      "output": "manifest 仓库克隆成功，init.py 就位",
      "error": "",
      "returncode": 0,
      "duration_seconds": 8
    },
    {
      "timestamp": "2026-09-07T06:04:08",
      "command": "cd /home/workspace/manifest && export OPENUBMC_LICENSE=true && echo 'Y' | python3 init.py -user ****** -psw '***'",
      "success": true,
      "output": "系统检测 Ubuntu（legacy-full）；安装 APT 依赖、bingo（apt deb 源+pip 升级）、Conan 2.32.0、Node v20.18.0/npm 10.8.2、pre-commit 工具（stylua/luacheck）、BMC SDK（/opt/RTOS/208.11.0、/opt/hcc_arm64le）、QEMU；配置并登录 Conan 远程 openubmc_opensource；摘要：openUBMC开发者环境初始化完成",
      "error": "",
      "returncode": 0,
      "duration_seconds": 388,
      "note": "init.py 内部执行 ln -snf /bin/bash /bin/sh，将容器 /bin/sh 软链由 dash 改为 bash"
    },
    {
      "timestamp": "2026-09-07T06:10:40",
      "command": "bingo --version && conan --version && node --version && npm --version && ls /opt/RTOS/ && conan remote list && conan search -r openubmc_opensource '*'",
      "success": true,
      "output": "bingo 0.8.14；Conan 2.32.0；node v20.18.0；npm 10.8.2；/opt/RTOS/208.11.0；openubmc_opensource 远程已配置且可检索到 abseil/account 等包",
      "error": "",
      "returncode": 0,
      "duration_seconds": 15
    },
    {
      "timestamp": "2026-09-07T06:11:00",
      "command": "cd /home/workspace/webui && bingo build --stage=dev",
      "success": true,
      "output": "Conan 导出 webui/1.100.113@openubmc.dev/dev；build() 执行 npm install（1034 packages in 35s）、npm run build（vite build ✓ built in 38.77s）、post-build gzip（426 files compressed）；package() 执行 npm install --production（94 packages in 7s），打包产物到 opt/bmc/web/htdocs/；构建成功",
      "error": "",
      "returncode": 0,
      "duration_seconds": 91,
      "note": "并发由 vite/esbuild 自管理，编译并发 ≤ 容器核数 60%（≤19）"
    },
    {
      "timestamp": "2026-09-07T06:12:40",
      "command": "ls /root/.conan2/p/b/webuiab0328b94dbcb/p/opt/bmc/web/htdocs/ && head index.html && du -sh dist/ && conan list webui",
      "success": true,
      "output": "打包产物 htdocs 含 index.html、assets(333)、font、image、style、style_config.json；dist 目录 14M；Conan 本地缓存 webui/1.100.113@openubmc.dev/dev",
      "error": "",
      "returncode": 0,
      "duration_seconds": 5
    },
    {
      "timestamp": "2026-09-07T06:13:07",
      "command": "cd /home/workspace/webui && npm install --no-audit --no-fund",
      "success": true,
      "output": "added 1032 packages in 30s（为执行 README 测试章节命令准备完整 devDependencies）",
      "error": "",
      "returncode": 0,
      "duration_seconds": 30
    },
    {
      "timestamp": "2026-09-07T06:13:31",
      "command": "npm run lint",
      "success": false,
      "output": "ESLint 8.57.1 启动后退出",
      "error": "No files matching the pattern \"src/**/*.js\" were found.（exit 2）",
      "returncode": 2,
      "duration_seconds": 1,
      "note": "根因：init.py 将 /bin/sh 软链为 bash，bash 对 src/**/*.{js,ts,vue,jsx,tsx} 做 brace 展开为 5 个独立 pattern；src 下无 .js 文件（仅 440 .ts / 354 .vue），src/**/*.js 无匹配且未开 nullglob，原样传给 eslint，eslint 报错退出"
    },
    {
      "timestamp": "2026-09-07T06:15:30",
      "command": "npm run lint --script-shell=/bin/dash（环境兼容性重试：改用标准 dash shell 避免 brace 展开）",
      "success": false,
      "output": "eslint 正常执行，检出 284 problems（256 errors, 28 warnings）；主要规则：max-lines-per-function、max-len、complexity、camelcase；涉及 VideoPlayer.vue、VncH5.vue、utils.ts、port-service.ts、header.service.ts 等",
      "error": "256 个不可自动修复的 ESLint 错误（--fix 无法修复，max-lines/max-len/complexity/camelcase 均为非自动修复规则）",
      "returncode": 1,
      "duration_seconds": 37,
      "note": "改用 dash 后命令本身可运行，证实源码未达到 lint 零错误"
    },
    {
      "timestamp": "2026-09-07T06:13:59",
      "command": "npx vue-tsc --noEmit",
      "success": false,
      "output": "tsconfig.json(17,5): error TS5101",
      "error": "Option 'suppressImplicitAnyIndexErrors' is deprecated and will stop functioning in TypeScript 5.5. Specify compilerOption \"ignoreDeprecations\": \"5.0\" to silence this error.（exit 2，配置解析阶段即失败，未进入类型检查）",
      "returncode": 2,
      "duration_seconds": 31,
      "note": "tsconfig.json 第17行启用 suppressImplicitAnyIndexErrors，在仓库自身锁定的 typescript 5.5.2 中为硬错误；属仓库配置问题，未修改源码"
    },
    {
      "timestamp": "2026-09-07T06:17:14",
      "command": "CI=true npx vitest run（仓库 package.json 配置的单元测试套件，README 测试章节未记录）",
      "success": false,
      "output": "Test Files 1 failed | 9 passed (10)；Tests 1 failed | 210 passed (211)；Duration 3.29s；JUnit 报告 tests/reports/js_test.xml",
      "error": "tests/unit/utils/date.spec.ts > Date.prototype.pattern Tests > should format hour correctly：AssertionError expected '12' to be '20'（HH 24 小时格式输出与预期不符，疑似时区/时间相关用例）",
      "returncode": 1,
      "duration_seconds": 17
    },
    {
      "timestamp": "2026-09-07T06:18:00",
      "command": "cat dist/index.html | head && ls dist/assets | wc -l（构建产物冒烟检查）",
      "success": true,
      "output": "打包 htdocs/index.html 有效（DOCTYPE、title version=3.0、favicon 引用、ptc 解析脚本）；assets 目录 333 个文件；总包 4.4M",
      "error": "",
      "returncode": 0,
      "duration_seconds": 5
    },
    {
      "timestamp": "2026-09-07T06:20:00",
      "command": "docker rm -f ttfhw-webui-env",
      "success": true,
      "output": "容器已停止并删除",
      "error": "",
      "returncode": 0,
      "duration_seconds": 2
    }
  ],
  "process_timeline": [
    {
      "timestamp": "2026-09-07T05:58:00",
      "step": "start",
      "action": "开始 webui 仓库容器化构建与测试验证流程",
      "result": "已启动",
      "details": {}
    },
    {
      "timestamp": "2026-09-07T05:58:05",
      "step": "document_reading",
      "action": "阅读 README.md、package.json、conanfile.py、.pre-commit-config.yaml、.devcontainer/devcontainer.json 及 manifest 仓库构建指导书",
      "result": "成功",
      "details": {"sections_read": ["系统要求", "环境依赖", "构建", "测试", "本地开发调试"], "manifest_doc": "openUBMC 26.06 版本构建指导书"}
    },
    {
      "timestamp": "2026-09-07T05:58:10",
      "step": "static_analysis_scan",
      "action": "检查仓库 pre-commit 配置",
      "result": "已配置",
      "details": {"config_file": ".pre-commit-config.yaml", "hooks_total": 13, "repos": ["openUBMC/pre-commit-hooks@0.1.1", "gh_mirrors/pr/pre-commit-hooks@v6.0.0", "local"]}
    },
    {
      "timestamp": "2026-09-07T05:58:00",
      "step": "static_analysis_execution",
      "action": "执行 pre-commit run --all-files",
      "result": "全部通过",
      "details": {"passed": 10, "failed": 0, "skipped": 3, "skipped_reason": "conventional-commit/add-signoff-and-change-id 为 commit-msg 钩子在 --all-files 模式不执行；check-sr 无 .sr 文件"}
    },
    {
      "timestamp": "2026-09-07T05:58:05",
      "step": "static_analysis_scan",
      "action": "检查 lint-runner 配置",
      "result": "未配置",
      "details": {"searched_patterns": [".lint-runner.yaml", ".lint-runner.json", "lint-runner.config.*", ".lintrunner.toml"]}
    },
    {
      "timestamp": "2026-09-07T05:58:10",
      "step": "devcontainer_scan",
      "action": "检查 .devcontainer 目录及配置",
      "result": "已配置",
      "details": {"config_dir": ".devcontainer", "files": ["devcontainer.json"], "image": "swr.cn-north-4.myhuaweicloud.com/openubmc/ubuntu:24.04.2_26.06", "forwardPorts": [8000, 8080], "extensions_count": 12}
    },
    {
      "timestamp": "2026-09-07T05:58:25",
      "step": "image_selection",
      "action": "选择基础镜像",
      "result": "openubmc/ubuntu:24.04.2",
      "details": {"selection_reason": "README 明确仅支持 Ubuntu 24.04 LTS 并推荐该镜像"}
    },
    {
      "timestamp": "2026-09-07T05:58:35",
      "step": "container_setup",
      "action": "拉取镜像并启动容器",
      "result": "成功",
      "details": {"image": "swr.cn-north-4.myhuaweicloud.com/openubmc/ubuntu:24.04.2", "container": "ttfhw-webui-env", "mount": "仓库目录:/home/workspace/webui"}
    },
    {
      "timestamp": "2026-09-07T05:59:00",
      "step": "dependency_installation",
      "action": "安装容器基础工具（python3/sudo/git/curl/libcurl 等）",
      "result": "成功",
      "details": {"packages": ["python3", "sudo", "make", "locales", "wget", "curl", "git", "libcurl4t64", "libcurl4-openssl-dev", "pkg-config"]}
    },
    {
      "timestamp": "2026-09-07T06:03:00",
      "step": "dependency_installation",
      "action": "配置 Git 并克隆 manifest 仓库",
      "result": "成功",
      "details": {"manifest_repo": "https://gitcode.com/openUBMC/manifest.git", "path": "/home/workspace/manifest"}
    },
    {
      "timestamp": "2026-09-07T06:04:08",
      "step": "dependency_installation",
      "action": "执行 init.py 一键初始化（安装 bingo/Conan/Node/pre-commit 工具/SDK/QEMU，配置并登录 Conan 远程）",
      "result": "成功",
      "details": {"bingo": "0.8.14", "conan": "2.32.0", "node": "v20.18.0", "npm": "10.8.2", "rtos": "/opt/RTOS/208.11.0", "conan_remote": "openubmc_opensource", "duration_seconds": 388}
    },
    {
      "timestamp": "2026-09-07T06:11:00",
      "step": "build_attempt",
      "action": "执行 bingo build --stage=dev 组件级构建",
      "result": "成功",
      "details": {"concurrency_ratio": "60%(≤19)", "duration_seconds": 91, "package": "webui/1.100.113@openubmc.dev/dev"}
    },
    {
      "timestamp": "2026-09-07T06:12:40",
      "step": "build_verification",
      "action": "验证构建产物",
      "result": "成功",
      "details": {"dist_size": "14M", "htdocs_size": "4.4M", "assets_count": 333, "index_html_valid": true}
    },
    {
      "timestamp": "2026-09-07T06:13:31",
      "step": "ut_execution",
      "action": "执行 README 测试命令 npm run lint",
      "result": "失败",
      "details": {"error": "/bin/sh 被 init.py 软链为 bash，brace 展开导致 eslint 找不到 src/**/*.js 文件"}
    },
    {
      "timestamp": "2026-09-07T06:15:30",
      "step": "problem_resolution",
      "action": "环境兼容性重试：改用 dash script-shell 执行 npm run lint",
      "result": "命令可运行但源码不达标",
      "details": {"solution": "改用 /bin/dash 避免 brace 展开", "outcome": "检出 256 个不可自动修复的 ESLint 错误"}
    },
    {
      "timestamp": "2026-09-07T06:13:59",
      "step": "ut_execution",
      "action": "执行 README 测试命令 npx vue-tsc --noEmit",
      "result": "失败",
      "details": {"error": "TS5101：tsconfig.json 第17行 suppressImplicitAnyIndexErrors 在 typescript 5.5.2 中为硬错误"}
    },
    {
      "timestamp": "2026-09-07T06:17:14",
      "step": "ut_execution",
      "action": "执行仓库配置的 vitest 单元测试套件（npx vitest run）",
      "result": "部分成功",
      "details": {"total": 211, "passed": 210, "failed": 1, "failed_test": "tests/unit/utils/date.spec.ts > should format hour correctly"}
    },
    {
      "timestamp": "2026-09-07T06:18:00",
      "step": "sample_execution",
      "action": "对构建产物（web htdocs 静态包）执行冒烟检查",
      "result": "成功",
      "details": {"index_html_valid": true, "assets_count": 333, "package_size": "4.4M"}
    },
    {
      "timestamp": "2026-09-07T06:20:00",
      "step": "cleanup",
      "action": "停止并删除容器",
      "result": "成功",
      "details": {"container": "ttfhw-webui-env"}
    },
    {
      "timestamp": "2026-09-07T06:21:00",
      "step": "report_generation",
      "action": "生成验证报告 JSON 并转换为静态 HTML",
      "result": "成功",
      "details": {"output_file": "verification_report_WSL_webui_20260907.json"}
    }
  ],
  "final_results": {
    "static_analysis": {
      "enabled": true,
      "summary": "检测到 pre-commit 配置（13 个 hooks，--all-files 模式下 10 通过、3 跳过、0 失败），未检测到 lint-runner 配置",
      "pre_commit": {
        "configured": true,
        "config_file": ".pre-commit-config.yaml",
        "status": "通过",
        "duration_seconds": 30,
        "total_hooks": 13,
        "passed": 10,
        "failed": 0,
        "skipped": 3,
        "failures": []
      },
      "lint_runner": {
        "configured": false,
        "config_file": null
      }
    },
    "devcontainer": {
      "enabled": true,
      "config_dir": ".devcontainer",
      "config_files": ["devcontainer.json"],
      "summary": "已配置 devcontainer，基于 openubmc/ubuntu:24.04.2_26.06 镜像，工作目录 /workspace，转发端口 8000/8080，预装 12 个 VSCode 扩展（C++、CMake、Python、Ruff、GitLens 等）"
    },
    "build": {
      "status": "成功",
      "duration_seconds": 91,
      "concurrency": "vite/esbuild 自管理（≤ 容器核数 60% = 19）",
      "artifacts": [
        {
          "name": "Conan 组件包",
          "path": "~/.conan2/p/b/webuiab0328b94dbcb/p",
          "reference": "webui/1.100.113@openubmc.dev/dev",
          "size": "4.4M"
        },
        {
          "name": "Web 静态资源 htdocs",
          "path": "~/.conan2/p/b/webuiab0328b94dbcb/p/opt/bmc/web/htdocs/",
          "size": "4.4M",
          "contents": "index.html + assets(333) + font + image + style + style_config.json"
        },
        {
          "name": "Vite 构建产物 dist",
          "path": "~/.conan2/p/b/webuiab0328b94dbcb/b/dist/",
          "size": "14M"
        }
      ]
    },
    "ut": {
      "status": "部分失败",
      "duration_seconds": 86,
      "summary": "README 文档要求的测试命令 npm run lint 与 npx vue-tsc --noEmit 均失败；仓库配置的 vitest 单元测试套件执行 211 项，通过 210 项，失败 1 项（date.spec.ts 时区相关断言）。详见 execution_log。",
      "documented_tests": {
        "npm_run_lint": {"status": "失败", "reason": "init.py 将 /bin/sh 软链为 bash，brace 展开致 eslint 找不到 src/**/*.js；改用 dash 后检出 256 个不可自动修复的 ESLint 错误"},
        "npx_vue_tsc_noEmit": {"status": "失败", "reason": "tsconfig.json 第17行 suppressImplicitAnyIndexErrors 在 typescript 5.5.2 中为硬错误 TS5101"}
      },
      "vitest": {
        "total": 211,
        "passed": 210,
        "failed": 1,
        "test_files": "10（1 failed | 9 passed）",
        "duration_seconds": 17
      },
      "total": 211,
      "passed": 210,
      "failed": 1,
      "failures": [
        {
          "test_file": "tests/unit/utils/date.spec.ts",
          "test_name": "Date.prototype.pattern Tests > should format hour correctly",
          "error": "AssertionError: expected '12' to be '20'（HH 24 小时格式输出与预期不符，疑似时区/时间相关用例）"
        }
      ]
    },
    "sample": {
      "status": "成功",
      "duration_seconds": 5,
      "results": [
        {
          "sample_name": "Web htdocs 静态包冒烟检查",
          "execution_status": "成功",
          "output_summary": "打包产物 index.html 结构有效（DOCTYPE、title version=3.0、favicon 引用、ptc 解析脚本），assets 目录 333 个文件，font/image/style 资源齐全，总包 4.4M，Conan 本地缓存 webui/1.100.113@openubmc.dev/dev 可检索",
          "execution_time": "5秒"
        }
      ]
    }
  },
  "documentation_gaps": [
    "README 测试章节仅记录 npm run lint 与 npx vue-tsc --noEmit 两条命令，未提及仓库已在 package.json 配置的 vitest 单元测试套件（\"test\": \"vitest\"，tests/unit/ 下 10 个用例文件、211 个用例）",
    "README 测试命令 npm run lint 与 init.py 初始化环境不兼容：init.py 内部执行 ln -snf /bin/bash /bin/sh 将 /bin/sh 软链为 bash，导致 eslint 的 src/**/*.{js,ts,vue,jsx,tsx} 被 bash brace 展开为 5 个独立 pattern，src 下无 .js 文件（仅 440 .ts / 354 .vue），src/**/*.js 无匹配致 eslint 报错退出",
    "tsconfig.json 第17行启用 suppressImplicitAnyIndexErrors 选项，在仓库自身锁定的 typescript 5.5.2 中为硬错误（TS5101），导致 npx vue-tsc --noEmit 在配置解析阶段即失败；需添加 ignoreDeprecations: \"5.0\" 或移除该选项方可执行类型检查",
    "README 推荐镜像标签 swr.cn-north-4.myhuaweicloud.com/openubmc/ubuntu:24.04.2 与 .devcontainer/devcontainer.json 中 24.04.2_26.06 标签不一致",
    "npm run lint 即便改用标准 dash shell 可正常运行，仍检出 256 个不可自动修复的 ESLint 错误（max-lines-per-function、max-len、complexity、camelcase），源码未达到 lint 零错误",
    "README 构建章节声明禁止手动 pip install conan（会导致 Conan 远程认证失败），依赖必须经 manifest init.py 安装；该约束仅在 README 文字说明，未在 conanfile.py 或构建配置中体现"
  ],
  "problems_encountered": [
    {
      "timestamp": "2026-09-07T06:13:31",
      "problem": "README 测试命令 npm run lint 执行失败（exit 2）：eslint 报 No files matching the pattern \"src/**/*.js\" were found",
      "solution": "根因为 init.py 将 /bin/sh 软链为 bash 导致 brace 展开；尝试环境兼容性重试：npm run lint --script-shell=/bin/dash，命令可运行但检出 256 个真实 ESLint 错误（不可自动修复），未修改源码",
      "source": "manifest 仓库 init.py 内部 ln -snf /bin/bash /bin/sh + package.json lint 脚本 src/**/*.{js,ts,vue,jsx,tsx}"
    },
    {
      "timestamp": "2026-09-07T06:13:59",
      "problem": "README 测试命令 npx vue-tsc --noEmit 执行失败（exit 2）：tsconfig.json(17,5): error TS5101",
      "solution": "tsconfig.json 第17行 suppressImplicitAnyIndexErrors 在 typescript 5.5.2 中为硬错误，属仓库配置问题；按约束不改源码，记录失败原因",
      "source": "tsconfig.json 第17行: \"suppressImplicitAnyIndexErrors\": true"
    },
    {
      "timestamp": "2026-09-07T06:17:14",
      "problem": "vitest 单元测试 1 项失败：tests/unit/utils/date.spec.ts should format hour correctly，expected '20' received '12'",
      "solution": "HH 24 小时格式输出与预期不符，疑似时区/时间相关用例；未修改源码，记录失败详情",
      "source": "tests/unit/utils/date.spec.ts:38"
    }
  ],
  "conclusion": {
    "build_verdict": "成功——bingo build --stage=dev 在 Ubuntu 24.04 容器中按文档流程构建成功，产出 Conan 组件包 webui/1.100.113@openubmc.dev/dev 与 Web 静态资源 htdocs（4.4M，333 个 assets）",
    "test_verdict": "部分失败——README 文档要求的测试命令 npm run lint 与 npx vue-tsc --noEmit 均失败（前者因 init.py /bin/sh 软链 bash 致 brace 展开且源码存在 256 个 ESLint 错误；后者因 tsconfig 与锁定 TS 5.5.2 不兼容）；仓库配置的 vitest 单元测试 211 项中通过 210 项、失败 1 项（时区相关 date 用例）",
    "overall": "可在容器中成功构建；测试环节存在文档与环境的兼容性问题及少量用例失败，建议修复 tsconfig 选项、统一 /bin shell 或调整 lint 脚本通配符写法、修正 date.spec.ts 时区相关断言"
  }
}
